Target
C-X-C chemokine receptor type 4
Ligand
BDBM50196261
Substrate
Meas. Tech.
ChEMBL_1618264 (CHEMBL3860433)
IC50
90±n/a nM
Citation
 Mona, CEBesserer-Offroy, ÉCabana, JLefrançois, MBoulais, PELefebvre, MRLeduc, RLavigne, PHeveker, NMarsault, ÉEscher, E Structure-Activity Relationship and Signaling of New Chimeric CXCR4 Agonists. J Med Chem 59:7512-24 (2016)  
Target
Name:
C-X-C chemokine receptor type 4
Synonyms:
C-X-C chemokine receptor type 4 CD_antigen=CD184 CXCR-4 CXCR4_HUMAN Fusin LCR1 Leukocyte-derived seven transmembrane domain receptor SDF-1 receptor | Stromal cell-derived factor 1 receptor
Type:
Enzyme
Mol. Mass.:
39754.61
Organism:
Homo sapiens (Human)
Description:
P61073
Residue:
352
  
Inhibitor
Name:
BDBM50196261
Synonyms:
CHEMBL3959440
Type:
Small organic molecule
Emp. Form.:
C153H226N46O31S2
Mol. Mass.:
3269.851
SMILES:
CC(C)C[C@H](NC(=O)[C@H](CO)NC(=O)[C@H](Cc1cc2cccc3ccc4cccc1c4c23)NC(=O)[C@@H]1CCCN1C(=O)[C@@H](N)CCCCN)C(=O)N[C@@H](CO)C(=O)N[C@@H](Cc1ccc(O)cc1)C(=O)N[C@@H](CCCNC(N)=N)C(=O)N[C@@H](CO)C(=O)N[C@@H](C)C(=O)NCCCC[C@H](NC(=O)[C@@H]1CSSC[C@H](NC(=O)[C@H](Cc2ccc3ccccc3c2)NC(=O)[C@H](CCCNC(N)=N)NC(=O)[C@@H](N)CCCNC(N)=N)C(=O)N[C@@H](Cc2ccc(O)cc2)C(=O)N[C@@H](CCCNC(N)=N)C(=O)N[C@@H](CCCCN)C(=O)N[C@H](CCCCN)C(=O)N2CCC[C@H]2C(=O)N[C@@H](Cc2ccc(O)cc2)C(=O)N[C@@H](CCCNC(N)=N)C(=O)N[C@@H](CCCNC(N)=N)C(=O)N1)C(O)=O
: