Target
KiSS-1 receptor
Ligand
BDBM50196423
Substrate
Meas. Tech.
ChEMBL_1618633 (CHEMBL3860802)
EC50
20±n/a nM
Citation
 Nishizawa, NTakatsu, YKumano, SKiba, ABan, JTsutsumi, SMatsui, HMatsumoto, SIYamaguchi, MIkeda, YKusaka, MOhtaki, TItoh, FAsami, T Design and Synthesis of an Investigational Nonapeptide KISS1 Receptor (KISS1R) Agonist, Ac-d-Tyr-Hydroxyproline (Hyp)-Asn-Thr-Phe-azaGly-Leu-Arg(Me)-Trp-NH J Med Chem 59:8804-8811 (2016)  
Target
Name:
KiSS-1 receptor
Synonyms:
Gpr54 Kiss1r
Type:
PROTEIN
Mol. Mass.:
42915.37
Organism:
Rattus norvegicus
Description:
ChEMBL_1448383
Residue:
396
  
Inhibitor
Name:
BDBM50196423
Synonyms:
CHEMBL3977314
Type:
Small organic molecule
Emp. Form.:
C58H79FN16O15
Mol. Mass.:
1259.3445
SMILES:
CNC(=N)NCCC[C@H](NC(=O)[C@H](CC(C)C)NC(=O)NNC(=O)[C@H](Cc1cccc(F)c1)NC(=O)[C@@H](NC(=O)[C@H](CC(N)=O)NC(=O)[C@H](CCC(O)=O)NC(=O)[C@@H](Cc1ccc(O)cc1)NC(C)=O)[C@@H](C)O)C(=O)N[C@@H](Cc1c[nH]c2ccccc12)C(N)=O
: