Target
Potassium channel subfamily K member 18
Ligand
BDBM50197060
Substrate
Meas. Tech.
ChEMBL_1619071 (CHEMBL3861240)
EC50
6000±n/a nM
Citation
 Monteillier, ALoucif, AOmoto, KStevens, EBLainez, SSaintot, PPCao, LPryde, DC Investigation of the structure activity relationship of flufenamic acid derivatives at the human TRESK channel K Bioorg Med Chem Lett 26:4919-4924 (2016)  
Target
Name:
Potassium channel subfamily K member 18
Synonyms:
KCNK18 Potassium channel subfamily K member 18 TRIK TWIK-related spinal cord potassium channel
Type:
PROTEIN
Mol. Mass.:
43672.81
Organism:
Homo sapiens (Human)
Description:
ChEMBL_105638
Residue:
384
  
Inhibitor
Name:
BDBM50197060
Synonyms:
CHEMBL1417584
Type:
Small organic molecule
Emp. Form.:
C17H17N5
Mol. Mass.:
291.3504
SMILES:
C1CCc2c(C1)cccc2Nc1ccccc1-c1nnn[nH]1
: