Target
Phosphatidylinositol 3-kinase catalytic subunit type 3
Ligand
BDBM92862
Substrate
Meas. Tech.
ChEMBL_1619102 (CHEMBL3861271)
IC50
450±n/a nM
Citation
 Falasca, MHamilton, JRSelvadurai, MSundaram, KAdamska, AThompson, PE Class II Phosphoinositide 3-Kinases as Novel Drug Targets. J Med Chem 60:47-65 (2017)  
Target
Name:
Phosphatidylinositol 3-kinase catalytic subunit type 3
Synonyms:
BC033004 PIK3C3 Phosphatidylinositol 3-kinase catalytic subunit type 3 (PIK3C3) Phosphoinositide 3-Kinase (PI3K), Vps34 PtdIns-3-kinase type 3 hVPS34
Type:
Enzyme
Mol. Mass.:
101551.30
Organism:
Homo sapiens (Human)
Description:
Recombinant human Vps34 protein was expressed as monomeric GST-fusion and purified.
Residue:
887
  
Inhibitor
Name:
BDBM92862
Synonyms:
US9284315, BEZ-235 | mTOR Inhibitor, BEZ235
Type:
Small molecule
Emp. Form.:
C30H23N5O
Mol. Mass.:
469.5365
SMILES:
Cn1c2cnc3ccc(cc3c2n(-c2ccc(cc2)C(C)(C)C#N)c1=O)-c1cnc2ccccc2c1
: