Target
Leukotriene A-4 hydrolase
Ligand
BDBM50197085
Substrate
Meas. Tech.
ChEMBL_1619180 (CHEMBL3861349)
Kd
60±n/a nM
Citation
 Wittmann, SKKalinowsky, LKramer, JSBloecher, RKnapp, SSteinhilber, DPogoryelov, DProschak, EHeering, J Thermodynamic properties of leukotriene A Bioorg Med Chem 24:5243-5248 (2016)  
Target
Name:
Leukotriene A-4 hydrolase
Synonyms:
LKHA4_HUMAN LTA4 Leukotriene A(4) hydrolase Leukotriene A4 hydrolase
Type:
Hydrolase; metalloprotease
Mol. Mass.:
69280.41
Organism:
Homo sapiens (Human)
Description:
Human recombinant LTA4H.
Residue:
611
  
Inhibitor
Name:
BDBM50197085
Synonyms:
CHEMBL3921982
Type:
Small organic molecule
Emp. Form.:
C16H19NO2
Mol. Mass.:
257.3276
SMILES:
CN(C)CCOc1ccc(Oc2ccccc2)cc1
: