Target
Fatty acid-binding protein, heart
Ligand
BDBM50197092
Substrate
Meas. Tech.
ChEMBL_1619188 (CHEMBL3861357)
Ki
390±n/a nM
Citation
 Kühne, HObst-Sander, UKuhn, BConte, ACeccarelli, SMNeidhart, WRudolph, MGOttaviani, GGasser, RSo, SSLi, SZhang, XGao, LMyers, M Design and synthesis of selective, dual fatty acid binding protein 4 and 5 inhibitors. Bioorg Med Chem Lett 26:5092-5097 (2016)  
Target
Name:
Fatty acid-binding protein, heart
Synonyms:
FABP11 FABPH_HUMAN MDGI
Type:
PROTEIN
Mol. Mass.:
14858.36
Organism:
Homo sapiens (Human)
Description:
ChEMBL_1463784
Residue:
133
  
Inhibitor
Name:
BDBM50197092
Synonyms:
CHEMBL3947458
Type:
Small organic molecule
Emp. Form.:
C19H16ClNO2
Mol. Mass.:
325.789
SMILES:
CC(C)c1nc2ccc(Cl)cc2c(-c2ccccc2)c1C(O)=O
: