Target
Carbonic anhydrase 1
Ligand
BDBM50197809
Substrate
Meas. Tech.
ChEMBL_1619736 (CHEMBL3861905)
Ki
7.9±n/a nM
Citation
 Nocentini, AFerraroni, MCarta, FCeruso, MGratteri, PLanzi, CMasini, ESupuran, CT Benzenesulfonamides Incorporating Flexible Triazole Moieties Are Highly Effective Carbonic Anhydrase Inhibitors: Synthesis and Kinetic, Crystallographic, Computational, and Intraocular Pressure Lowering Investigations. J Med Chem 59:10692-10704 (2016)  
Target
Name:
Carbonic anhydrase 1
Synonyms:
CA-I CAB Carbonate dehydratase I Carbonic anhydrase 1 (CA I) Carbonic anhydrase 1 (Recombinant CA I) Carbonic anhydrase B Carbonic anhydrase I (CA I) Carbonic anhydrase I (CAI) Carbonic anhydrase isoenzyme I (hCA I) | hCA
Type:
Enzyme
Mol. Mass.:
28873.37
Organism:
Homo sapiens (Human)
Description:
P00915
Residue:
261
  
Inhibitor
Name:
BDBM50197809
Synonyms:
CHEMBL3908714
Type:
Small organic molecule
Emp. Form.:
C15H15N5O2S
Mol. Mass.:
329.377
SMILES:
NS(=O)(=O)c1ccc(cc1)-n1cc(CNc2ccccc2)nn1
: