Target
Carbonic anhydrase 2
Ligand
BDBM50197810
Substrate
Meas. Tech.
ChEMBL_1619737 (CHEMBL3861906)
Ki
1.000000±n/a nM
Citation
 Nocentini, AFerraroni, MCarta, FCeruso, MGratteri, PLanzi, CMasini, ESupuran, CT Benzenesulfonamides Incorporating Flexible Triazole Moieties Are Highly Effective Carbonic Anhydrase Inhibitors: Synthesis and Kinetic, Crystallographic, Computational, and Intraocular Pressure Lowering Investigations. J Med Chem 59:10692-10704 (2016)  
Target
Name:
Carbonic anhydrase 2
Synonyms:
CA-II CAC Carbonate dehydratase II Carbonic anhydrase 2 (CA-II) Carbonic anhydrase C Carbonic anhydrase II (CA-II) Carbonic anhydrase II (hCA II) | Carbonic anhydrase isoenzyme II (hCA II)
Type:
Enzyme
Mol. Mass.:
29250.71
Organism:
Homo sapiens (Human)
Description:
P00918
Residue:
260
  
Inhibitor
Name:
BDBM50197810
Synonyms:
CHEMBL3899660
Type:
Small organic molecule
Emp. Form.:
C15H14N4O4S
Mol. Mass.:
346.361
SMILES:
NS(=O)(=O)c1ccc(OCc2cn(nn2)-c2ccc(O)cc2)cc1
: