Target
Carbonic anhydrase 12
Ligand
BDBM50197814
Substrate
Meas. Tech.
ChEMBL_1619739 (CHEMBL3861908)
Ki
3.2±n/a nM
Citation
 Nocentini, AFerraroni, MCarta, FCeruso, MGratteri, PLanzi, CMasini, ESupuran, CT Benzenesulfonamides Incorporating Flexible Triazole Moieties Are Highly Effective Carbonic Anhydrase Inhibitors: Synthesis and Kinetic, Crystallographic, Computational, and Intraocular Pressure Lowering Investigations. J Med Chem 59:10692-10704 (2016)  
Target
Name:
Carbonic anhydrase 12
Synonyms:
CA-XII CAH12_HUMAN Carbonic anhydrase Carbonic anhydrase XII Carbonic anhydrase XII (CAXII) | Tumor antigen HOM-RCC-3.1.3
Type:
Enzyme
Mol. Mass.:
39456.00
Organism:
Homo sapiens (Human)
Description:
Catalytic domain of human cloned isozyme was used in the assay
Residue:
354
  
Inhibitor
Name:
BDBM50197814
Synonyms:
CHEMBL3890688
Type:
Small organic molecule
Emp. Form.:
C15H13FN4O3S
Mol. Mass.:
348.352
SMILES:
NS(=O)(=O)c1ccc(OCc2cn(nn2)-c2ccc(F)cc2)cc1
: