Target
Beta-galactosidase
Ligand
BDBM50375511
Substrate
Meas. Tech.
ChEMBL_1620014 (CHEMBL3862297)
Ki
4300±n/a nM
Citation
 Mena-Barragán, TGarcía-Moreno, MINanba, EHigaki, KConcia, ALClapés, PGarcía Fernández, JMOrtiz Mellet, C Inhibitor versus chaperone behaviour of d-fagomine, DAB and LAB sp(2)-iminosugar conjugates against glycosidases: A structure-activity relationship study in Gaucher fibroblasts. Eur J Med Chem 121:880-891 (2016)  
Target
Name:
Beta-galactosidase
Synonyms:
BGAL_ECOLI beta-Galactosidase (β-gal) | lacZ
Type:
Protein
Mol. Mass.:
116458.31
Organism:
Escherichia coli (Enterobacteria)
Description:
P00722
Residue:
1024
  
Inhibitor
Name:
BDBM50375511
Synonyms:
CHEMBL406973
Type:
Small organic molecule
Emp. Form.:
C5H11NO3
Mol. Mass.:
133.1457
SMILES:
OC[C@@H]1NC[C@H](O)[C@H]1O
: