Target
Transthyretin
Ligand
BDBM50197883
Substrate
Meas. Tech.
ChEMBL_1620069 (CHEMBL3862352)
Kd
9.3±n/a nM
Citation
 Simões, CJVAlmeida, ZLCosta, DJesus, CSHCardoso, ALAlmeida, MRSaraiva, MJPinho E Melo, TMVDBrito, RMM A novel bis-furan scaffold for transthyretin stabilization and amyloid inhibition. Eur J Med Chem 121:823-840 (2016)  
Target
Name:
Transthyretin
Synonyms:
ATTR Prealbumin TTHY_HUMAN Transthyretin (TTR)
Type:
Enzyme
Mol. Mass.:
15884.31
Organism:
Homo sapiens (Human)
Description:
P02766
Residue:
147
  
Inhibitor
Name:
BDBM50197883
Synonyms:
CHEBI:78538 Tafamidis Vyndaqel
Type:
Small organic molecule
Emp. Form.:
C14H7Cl2NO3
Mol. Mass.:
308.116
SMILES:
OC(=O)c1ccc2nc(oc2c1)-c1cc(Cl)cc(Cl)c1
: