Target
Amine oxidase [flavin-containing] B
Ligand
BDBM50199095
Substrate
Meas. Tech.
ChEMBL_1621074 (CHEMBL3863357)
IC50
11±n/a nM
Citation
 Wang, ZWu, JYang, XCai, PLiu, QWang, KDGKong, LWang, X Neuroprotective effects of benzyloxy substituted small molecule monoamine oxidase B inhibitors in Parkinson's disease. Bioorg Med Chem 24:5929-5940 (2016)  
Target
Name:
Amine oxidase [flavin-containing] B
Synonyms:
AOFB_HUMAN MAOB Monoamine oxidase type B (MAO B) Monoamine oxidase type B (MAOB)
Type:
Protein
Mol. Mass.:
58768.76
Organism:
Homo sapiens (Human)
Description:
P27338
Residue:
520
  
Inhibitor
Name:
BDBM50199095
Synonyms:
CHEMBL3771110
Type:
Small organic molecule
Emp. Form.:
C15H13ClO2
Mol. Mass.:
260.716
SMILES:
CC(=O)c1cccc(OCc2ccc(Cl)cc2)c1
: