Target
Amine oxidase [flavin-containing] B
Ligand
BDBM50199108
Substrate
Meas. Tech.
ChEMBL_1621074 (CHEMBL3863357)
IC50
13±n/a nM
Citation
 Wang, ZWu, JYang, XCai, PLiu, QWang, KDGKong, LWang, X Neuroprotective effects of benzyloxy substituted small molecule monoamine oxidase B inhibitors in Parkinson's disease. Bioorg Med Chem 24:5929-5940 (2016)  
Target
Name:
Amine oxidase [flavin-containing] B
Synonyms:
AOFB_HUMAN MAOB Monoamine oxidase type B (MAO B) Monoamine oxidase type B (MAOB)
Type:
Protein
Mol. Mass.:
58768.76
Organism:
Homo sapiens (Human)
Description:
P27338
Residue:
520
  
Inhibitor
Name:
BDBM50199108
Synonyms:
CHEMBL3919232
Type:
Small organic molecule
Emp. Form.:
C15H12ClFO2
Mol. Mass.:
278.706
SMILES:
CC(=O)c1ccc(OCc2cccc(Cl)c2)cc1F
: