Target
Histone deacetylase 3
Ligand
BDBM50199119
Substrate
Meas. Tech.
ChEMBL_1621341 (CHEMBL3863624)
IC50
20200±n/a nM
Citation
 Jadhavar, PSRamachandran, SARiquelme, EGupta, AQuinn, KPShivakumar, DRay, SZende, DNayak, AKMiglani, SKSathe, BDRaja, MFarias, OAlfaro, IBelmar, SGuerrero, JBernales, SChakravarty, SHung, DTLindquist, JNRai, R Targeting prostate cancer with compounds possessing dual activity as androgen receptor antagonists and HDAC6 inhibitors. Bioorg Med Chem Lett 26:5222-5228 (2016)  
Target
Name:
Histone deacetylase 3
Synonyms:
HD3 HDAC3_HUMAN Human HDAC3 SMAP45
Type:
Enzyme
Mol. Mass.:
48829.55
Organism:
Homo sapiens (Human)
Description:
O15379
Residue:
428
  
Inhibitor
Name:
BDBM50199119
Synonyms:
CHEMBL3948452
Type:
Small organic molecule
Emp. Form.:
C28H21F4N5O2S
Mol. Mass.:
567.557
SMILES:
CC1(C)N(C(=S)N(C1=O)c1ccc(C#N)c(c1)C(F)(F)F)c1ccc(\C=C\C(=O)Nc2ccccc2N)c(F)c1
: