Target
Histone deacetylase 6
Ligand
BDBM50199118
Substrate
Meas. Tech.
ChEMBL_1621342 (CHEMBL3863625)
IC50
2.0±n/a nM
Citation
 Jadhavar, PSRamachandran, SARiquelme, EGupta, AQuinn, KPShivakumar, DRay, SZende, DNayak, AKMiglani, SKSathe, BDRaja, MFarias, OAlfaro, IBelmar, SGuerrero, JBernales, SChakravarty, SHung, DTLindquist, JNRai, R Targeting prostate cancer with compounds possessing dual activity as androgen receptor antagonists and HDAC6 inhibitors. Bioorg Med Chem Lett 26:5222-5228 (2016)  
Target
Name:
Histone deacetylase 6
Synonyms:
Cereblon/Histone deacetylase 6 HDAC6 Histone deacetylase 6 (HDAC6) KIAA0901 | ORF Names:JM21
Type:
Chromatin regulator; hydrolase; repressor
Mol. Mass.:
131381.51
Organism:
Homo sapiens (Human)
Description:
Q9UBN7
Residue:
1215
  
Inhibitor
Name:
BDBM50199118
Synonyms:
CHEMBL3894825
Type:
Small organic molecule
Emp. Form.:
C26H24F4N4O5S
Mol. Mass.:
580.551
SMILES:
CC1(C)N(C(=S)N(C1=O)c1ccc(C#N)c(c1)C(F)(F)F)c1ccc(C(=O)OCCCCCC(=O)NO)c(F)c1
: