Target
Histone deacetylase 1
Ligand
BDBM50199115
Substrate
Meas. Tech.
ChEMBL_1621339 (CHEMBL3863622)
IC50
>10000±n/a nM
Citation
 Jadhavar, PSRamachandran, SARiquelme, EGupta, AQuinn, KPShivakumar, DRay, SZende, DNayak, AKMiglani, SKSathe, BDRaja, MFarias, OAlfaro, IBelmar, SGuerrero, JBernales, SChakravarty, SHung, DTLindquist, JNRai, R Targeting prostate cancer with compounds possessing dual activity as androgen receptor antagonists and HDAC6 inhibitors. Bioorg Med Chem Lett 26:5222-5228 (2016)  
Target
Name:
Histone deacetylase 1
Synonyms:
Cereblon/Histone deacetylase 1 HDAC1 Histone deacetylase 1 (HDAC1) RPD3L1
Type:
Enzyme
Mol. Mass.:
55090.27
Organism:
Homo sapiens (Human)
Description:
Q13547
Residue:
482
  
Inhibitor
Name:
BDBM50199115
Synonyms:
CHEMBL3921621
Type:
Small organic molecule
Emp. Form.:
C31H29F4N5O3S2
Mol. Mass.:
659.717
SMILES:
CC1(C)N(C(=S)N(C1=O)c1ccc(C#N)c(c1)C(F)(F)F)c1ccc(C(=O)NCCCCCCn2cccc(O)c2=S)c(F)c1
: