Target
Integrin beta-8
Ligand
BDBM50199398
Substrate
Meas. Tech.
ChEMBL_1621501 (CHEMBL3863784)
IC50
2000±n/a nM
Citation
 Reed, NITang, YZMcIntosh, JWu, YMolnar, KSCivitavecchia, ASheppard, DDeGrado, WFJo, H Exploring ACS Med Chem Lett 7:902-907 (2016)  
Target
Name:
Integrin beta-8
Synonyms:
ITB8_HUMAN | ITGB8
Type:
Protein
Mol. Mass.:
85643.68
Organism:
Homo sapiens (Human)
Description:
Residue:
769
  
Inhibitor
Name:
BDBM50199398
Synonyms:
CHEMBL3952235 | US10131658, Compound 211
Type:
Small organic molecule
Emp. Form.:
C27H36N6O6S
Mol. Mass.:
572.676
SMILES:
NC(=N)NCCCCC(=O)Nc1ccc(C[C@H](NC(=O)[C@@H]2CCCCN2S(=O)(=O)c2ccccc2)C(O)=O)cc1
: