Target
5-hydroxytryptamine receptor 2B
Ligand
BDBM50100425
Substrate
Meas. Tech.
ChEMBL_1621577 (CHEMBL3863860)
Ki
6470±n/a nM
Citation
 Tosh, DKCiancetta, AWarnick, ECrane, SGao, ZGJacobson, KA Structure-Based Scaffold Repurposing for G Protein-Coupled Receptors: Transformation of Adenosine Derivatives into 5HT J Med Chem 59:11006-11026 (2016)  
Target
Name:
5-hydroxytryptamine receptor 2B
Synonyms:
5-HT-2B 5-hydroxytryptamine (serotonin) receptor 2B [Homo sapiens] 5-hydroxytryptamine receptor 2C (5HT2C) HTR2B Serotonin 2b (5-HT2b) receptor | Serotonin Receptor 2B
Type:
G Protein-Coupled Receptor (GPCR)
Mol. Mass.:
54312.47
Organism:
Homo sapiens (Human)
Description:
Receptor binding assays were performed using human clone stably expressed in CHO cells.
Residue:
481
  
Inhibitor
Name:
BDBM50100425
Synonyms:
(1R,2R,3S,4R,5S)-4-(2-Chloro-6-methylamino-purin-9-yl)-1-hydroxymethyl-bicyclo[3.1.0]hexane-2,3-diol | CHEMBL286739
Type:
Small organic molecule
Emp. Form.:
C13H16ClN5O3
Mol. Mass.:
325.751
SMILES:
CNc1nc(Cl)nc2n(cnc12)[C@@H]1[C@H]2C[C@@]2(CO)[C@@H](O)[C@H]1O
: