Target
Adenosine receptor A2a
Ligand
BDBM50199699
Substrate
Meas. Tech.
ChEMBL_1621694 (CHEMBL3863977)
IC50
33±n/a nM
Citation
 Grŕcia, JBuil, MACastro, JEichhorn, PFerrer, MGavaldŕ, AHernández, BSegarra, VLehner, MDMoreno, IPagčs, LRoberts, RSSerrat, JSevilla, STaltavull, JAndrés, MCabedo, JVilella, DCalama, ECarcasona, CMiralpeix, M Biphenyl Pyridazinone Derivatives as Inhaled PDE4 Inhibitors: Structural Biology and Structure-Activity Relationships. J Med Chem 59:10479-10497 (2016)  
Target
Name:
Adenosine receptor A2a
Synonyms:
A2A adenosine receptor (hA2A) ADENOSINE A2 ADORA2 Adenosine A2A receptor (A2AAR)
Type:
G Protein-Coupled Receptor (GPCR)
Mol. Mass.:
44716.46
Organism:
Homo sapiens (Human)
Description:
P29274
Residue:
412
  
Inhibitor
Name:
BDBM50199699
Synonyms:
CHEMBL3986586
Type:
Small organic molecule
Emp. Form.:
C31H31Cl2N7O4
Mol. Mass.:
636.528
SMILES:
CCn1nc(cc(NC(=O)Nc2c(Cl)cncc2Cl)c1=O)-c1cccc(c1)-c1cccc(c1)C(=O)NCCN1CCOCC1
: