Target
Ectonucleotide pyrophosphatase/phosphodiesterase family member 2
Ligand
BDBM50200582
Substrate
Meas. Tech.
ChEMBL_1622710 (CHEMBL3865062)
IC50
3±n/a nM
Citation
 Shah, PCheasty, AFoxton, CRaynham, TFarooq, MGutierrez, IFLejeune, APritchard, MTurnbull, APang, LOwen, PBoyd, SStowell, AJordan, AHamilton, NMHitchin, JRStockley, MMacDonald, EQuesada, MJTrivier, ESkeete, JOvaa, HMoolenaar, WHRyder, H Discovery of potent inhibitors of the lysophospholipase autotaxin. Bioorg Med Chem Lett 26:5403-5410 (2016)  
Target
Name:
Ectonucleotide pyrophosphatase/phosphodiesterase family member 2
Synonyms:
ATX Autotaxin (ATX) ENPP2 Ectonucleotide Pyrophosphatase/Phosphodiesterase 2 (ENPP2) Extracellular lysophospholipase D PDNP2
Type:
Enzyme
Mol. Mass.:
99007.13
Organism:
Homo sapiens (Human)
Description:
Q13822
Residue:
863
  
Inhibitor
Name:
BDBM50200582
Synonyms:
CHEMBL3944813
Type:
Small organic molecule
Emp. Form.:
C25H25ClN4O2
Mol. Mass.:
448.945
SMILES:
COc1ccc(Cn2c(CCC(=O)N[C@@H](C)c3ccc(Cl)cc3)nc3cccnc23)cc1
: