Target
C-X-C chemokine receptor type 3
Ligand
BDBM50200677
Substrate
Meas. Tech.
ChEMBL_1622750 (CHEMBL3865102)
IC50
187±n/a nM
Citation
 Bata, ITömösközi, ZBuzder-Lantos, PVasas, ASzeleczky, GBátori, SBarta-Bodor, VBalázs, LFerenczy, GG I. Discovery of a novel series of CXCR3 antagonists. Multiparametric optimization of N,N-disubstituted benzylamines. Bioorg Med Chem Lett 26:5418-5428 (2016)  
Target
Name:
C-X-C chemokine receptor type 3
Synonyms:
AAO92295.1 C-X-C chemokine receptor type 3 (CXCR3) CXCR3 CXCR3_HUMAN chemokine (C-X-C motif) receptor 3
Type:
Enzyme Catalytic Domain
Mol. Mass.:
40665.65
Organism:
Homo sapiens (Human)
Description:
Residue:
368
  
Inhibitor
Name:
BDBM50200677
Synonyms:
CHEMBL3963969
Type:
Small organic molecule
Emp. Form.:
C24H27ClN2O4
Mol. Mass.:
442.935
SMILES:
CC(N(C)Cc1ccc(OCCN2C(=O)CCC2=O)c(Cl)c1)c1ccc2OCCc2c1
: