Target
C-X-C chemokine receptor type 3
Ligand
BDBM50200692
Substrate
Meas. Tech.
ChEMBL_1622750 (CHEMBL3865102)
IC50
126±n/a nM
Citation
 Bata, ITömösközi, ZBuzder-Lantos, PVasas, ASzeleczky, GBátori, SBarta-Bodor, VBalázs, LFerenczy, GG I. Discovery of a novel series of CXCR3 antagonists. Multiparametric optimization of N,N-disubstituted benzylamines. Bioorg Med Chem Lett 26:5418-5428 (2016)  
Target
Name:
C-X-C chemokine receptor type 3
Synonyms:
AAO92295.1 C-X-C chemokine receptor type 3 (CXCR3) CXCR3 CXCR3_HUMAN chemokine (C-X-C motif) receptor 3
Type:
Enzyme Catalytic Domain
Mol. Mass.:
40665.65
Organism:
Homo sapiens (Human)
Description:
Residue:
368
  
Inhibitor
Name:
BDBM50200692
Synonyms:
CHEMBL3981260
Type:
Small organic molecule
Emp. Form.:
C32H34N6O5
Mol. Mass.:
582.6496
SMILES:
COc1cc(CN(Cc2ccc(cc2)-c2nnn[nH]2)C(C)c2ccc3OCCc3c2)ccc1OCCN1C(=O)CCC1=O
: