Target
Tyrosine-protein kinase Mer
Ligand
BDBM50201174
Substrate
Meas. Tech.
ChEMBL_1622920 (CHEMBL3865272)
IC50
32±n/a nM
Citation
 Wang, XLiu, JZhang, WStashko, MANichols, JMiley, MJNorris-Drouin, JChen, ZMachius, MDeRyckere, DWood, EGraham, DKEarp, HSKireev, DFrye, SV Design and Synthesis of Novel Macrocyclic Mer Tyrosine Kinase Inhibitors. ACS Med Chem Lett 7:1044-1049 (2016)  
Target
Name:
Tyrosine-protein kinase Mer
Synonyms:
MER MERTK Proto-oncogene c-Mer Receptor tyrosine kinase MerTK | Tyrosine-protein kinase Mer
Type:
PROTEIN
Mol. Mass.:
110234.77
Organism:
Homo sapiens (Human)
Description:
ChEMBL_1498723
Residue:
999
  
Inhibitor
Name:
BDBM50201174
Synonyms:
CHEMBL3969591
Type:
Small organic molecule
Emp. Form.:
C28H39N5O2
Mol. Mass.:
477.6416
SMILES:
OC1CCCCCCCNc2ncc3c(cn(CCCC1)c3n2)-c1ccc(cc1)N1CCOCC1
: