Target
Tyrosine-protein kinase Mer
Ligand
BDBM50201175
Substrate
Meas. Tech.
ChEMBL_1622920 (CHEMBL3865272)
IC50
8.9±n/a nM
Citation
 Wang, XLiu, JZhang, WStashko, MANichols, JMiley, MJNorris-Drouin, JChen, ZMachius, MDeRyckere, DWood, EGraham, DKEarp, HSKireev, DFrye, SV Design and Synthesis of Novel Macrocyclic Mer Tyrosine Kinase Inhibitors. ACS Med Chem Lett 7:1044-1049 (2016)  
Target
Name:
Tyrosine-protein kinase Mer
Synonyms:
MER MERTK Proto-oncogene c-Mer Receptor tyrosine kinase MerTK | Tyrosine-protein kinase Mer
Type:
PROTEIN
Mol. Mass.:
110234.77
Organism:
Homo sapiens (Human)
Description:
ChEMBL_1498723
Residue:
999
  
Inhibitor
Name:
BDBM50201175
Synonyms:
CHEMBL3961508
Type:
Small organic molecule
Emp. Form.:
C28H40N8O
Mol. Mass.:
504.6702
SMILES:
CN1CCN(Cc2ccc(cc2)-c2cn3CCCC[C@H](N)C(=O)NCCCCNc4ncc2c3n4)CC1
: