Target
Coagulation factor VII/Tissue factor
Ligand
BDBM50201417
Substrate
Meas. Tech.
ChEMBL_1623064 (CHEMBL3865416)
Ki
93±n/a nM
Citation
 Wurtz, NRParkhurst, BLJiang, WDeLucca, IZhang, XLadziata, VCheney, DLBozarth, JRRendina, ARWei, ALuettgen, JMWu, YWong, PCSeiffert, DAWexler, RRPriestley, ES Discovery of Phenylglycine Lactams as Potent Neutral Factor VIIa Inhibitors. ACS Med Chem Lett 7:1077-1081 (2016)  
Target
Name:
Coagulation factor VII/Tissue factor
Synonyms:
Coagulation factor III/Factor VIIa (fVIIa) | Coagulation factor III/VII
Type:
Mol. Mass.:
Description:
ASSAY_ID of EBI is 69535
Components:
This complex has 2 components.
Component 1
Name:
Tissue factor
Synonyms:
CD_antigen=CD142 Coagulation factor VII/tissue factor TF Thromboplastin | Tissue factor
Type:
PROTEIN
Mol. Mass.:
33067.61
Organism:
Homo sapiens (Human)
Description:
ChEMBL_936735
Residue:
295
  
Component 2
Name:
Coagulation factor VII
Synonyms:
Eptacog alfa FA7_HUMAN Factor VIIa (fVIIa) SPCA serum prothrombin conversion accelerator
Type:
Enzyme
Mol. Mass.:
51599.89
Organism:
Homo sapiens (Human)
Description:
Residue:
466
  
Inhibitor
Name:
BDBM50201417
Synonyms:
CHEMBL3902535
Type:
Small organic molecule
Emp. Form.:
C35H40N4O8S
Mol. Mass.:
676.779
SMILES:
COC(=O)Nc1ccc(c(c1)[C@H]1CCCN1C(=O)[C@H](Nc1ccc2c(C)c[nH]c(=O)c2c1)c1ccc(OC)c(OC)c1)S(=O)(=O)C(C)C
: