Target
Probable G-protein coupled receptor 142
Ligand
BDBM50201606
Substrate
Meas. Tech.
ChEMBL_1623128 (CHEMBL3865480)
EC50
19±n/a nM
Citation
 Guo, LParker, DLZang, YSweis, RFLiu, WSherer, ECBuist, NTerebetski, JKelly, TBugianesi, RPriest, BTDingley, KHLi, XMitelman, SSalituro, GTrujillo, MEPachanski, MKirkland, MPowles, MAEiermann, GJFeng, YShang, JHoward, ADUjjainwalla, FSinz, CJDebenham, JSEdmondson, SDNargund, RPHagmann, WKLi, D Discovery and Optimization of a Novel Triazole Series of GPR142 Agonists for the Treatment of Type 2 Diabetes. ACS Med Chem Lett 7:1107-1111 (2016)  
Target
Name:
Probable G-protein coupled receptor 142
Synonyms:
GP142_MOUSE | Gpr142
Type:
PROTEIN
Mol. Mass.:
40779.27
Organism:
Mus musculus
Description:
ChEMBL_985965
Residue:
365
  
Inhibitor
Name:
BDBM50201606
Synonyms:
CHEMBL3896713
Type:
Small organic molecule
Emp. Form.:
C20H15Cl2FN6O
Mol. Mass.:
445.277
SMILES:
Cc1cn(cn1)-c1ccc(-c2cn(CC(=O)Nc3cccc(Cl)c3Cl)nn2)c(F)c1
: