Target
Serine/threonine-protein kinase PAK 1
Ligand
BDBM50201647
Substrate
Meas. Tech.
ChEMBL_1623178 (CHEMBL3865530)
IC50
860±n/a nM
Citation
 McCoull, WHennessy, EJBlades, KChuaqui, CDowling, JEFerguson, ADGoldberg, FWHowe, NJones, CRKemmitt, PDLamont, GVarnes, JGWard, RAYang, B Optimization of Highly Kinase Selective Bis-anilino Pyrimidine PAK1 Inhibitors. ACS Med Chem Lett 7:1118-1123 (2016)  
Target
Name:
Serine/threonine-protein kinase PAK 1
Synonyms:
2.7.11.1 Cell division control protein 42 homolog PAK-1 PAK1_HUMAN p21-activated kinase 1 | p65-PAK
Type:
Mol. Mass.:
60640.15
Organism:
Homo sapiens (Human)
Description:
Q13153
Residue:
545
  
Inhibitor
Name:
BDBM50201647
Synonyms:
CHEMBL3961614
Type:
Small organic molecule
Emp. Form.:
C24H28FN5O4S
Mol. Mass.:
501.574
SMILES:
CN(c1cc(CO)ccc1C)c1nc(Nc2cc(cc(c2)S(C)(=O)=O)N2CCOCC2)ncc1F
: