Target
Serine/threonine-protein kinase PAK 1
Ligand
BDBM50201655
Substrate
Meas. Tech.
ChEMBL_1623178 (CHEMBL3865530)
IC50
490±n/a nM
Citation
 McCoull, WHennessy, EJBlades, KChuaqui, CDowling, JEFerguson, ADGoldberg, FWHowe, NJones, CRKemmitt, PDLamont, GVarnes, JGWard, RAYang, B Optimization of Highly Kinase Selective Bis-anilino Pyrimidine PAK1 Inhibitors. ACS Med Chem Lett 7:1118-1123 (2016)  
Target
Name:
Serine/threonine-protein kinase PAK 1
Synonyms:
2.7.11.1 Cell division control protein 42 homolog PAK-1 PAK1_HUMAN p21-activated kinase 1 | p65-PAK
Type:
Mol. Mass.:
60640.15
Organism:
Homo sapiens (Human)
Description:
Q13153
Residue:
545
  
Inhibitor
Name:
BDBM50201655
Synonyms:
CHEMBL3924245
Type:
Small organic molecule
Emp. Form.:
C26H33FN6O3S
Mol. Mass.:
528.642
SMILES:
CCS(=O)(=O)c1cc(Nc2ncc(F)c(n2)N(C)c2cc(CO)ccc2C)ccc1N1CCN(C)CC1
: