Target
Tyrosine-protein kinase ZAP-70
Ligand
BDBM50075735
Substrate
Meas. Tech.
ChEMBL_1623317 (CHEMBL3865669)
IC50
5.3±n/a nM
Citation
 Ellis, JMAltman, MDCash, BHaidle, AMKubiak, RLMaddess, MLYan, YNorthrup, AB Carboxamide Spleen Tyrosine Kinase (Syk) Inhibitors: Leveraging Ground State Interactions To Accelerate Optimization. ACS Med Chem Lett 7:1151-1155 (2016)  
Target
Name:
Tyrosine-protein kinase ZAP-70
Synonyms:
70 kDa zeta-associated protein Syk-related tyrosine kinase Tyrosine-protein kinase ZAP-70 Tyrosine-protein kinase ZAP-70 (ZAP70) ZAP70 Zeta-chain (TCR) associated protein kinase 70kDa
Type:
Enzyme
Mol. Mass.:
69881.61
Organism:
Homo sapiens (Human)
Description:
ZAP-70 SH2 domain was expressed and purified from E. coli using O-phospho-L-tyrosine-agarose column.
Residue:
619
  
Inhibitor
Name:
BDBM50075735
Synonyms:
CHEMBL3415583
Type:
Small organic molecule
Emp. Form.:
C19H26N6O
Mol. Mass.:
354.4493
SMILES:
Cc1cc(C)nc(Nc2cc(N[C@@H]3CCCC[C@@H]3N)cnc2C(N)=O)c1
: