Target
Broad substrate specificity ATP-binding cassette transporter ABCG2
Ligand
BDBM50202247
Substrate
Meas. Tech.
ChEBML_1623937
EC50
260±n/a nM
Citation
 Pires, ADRALecerf-Schmidt, FGuragossian, NPazinato, JGozzi, GJWinter, EValdameri, GVeale, ABoumendjel, ADi Pietro, APérès, B New, highly potent and non-toxic, chromone inhibitors of the human breast cancer resistance protein ABCG2. Eur J Med Chem 122:291-301 (2016)  
Target
Name:
Broad substrate specificity ATP-binding cassette transporter ABCG2
Synonyms:
ABCG2 ABCP ATP-binding cassette sub-family G member 2 ATP-binding cassette, sub-family G, member 2 BCRP1 CDw338 Mitoxantrone resistance-associated protein Urate exporter
Type:
Multi-pass membrane protein; monomer or homodimer; disulfide-linked
Mol. Mass.:
72329.48
Organism:
Homo sapiens (Human)
Description:
Q9UNQ0
Residue:
655
  
Inhibitor
Name:
BDBM50202247
Synonyms:
CHEMBL3983563
Type:
Small organic molecule
Emp. Form.:
C28H23FN2O5
Mol. Mass.:
486.491
SMILES:
COc1ccc2[nH]cc(CCNC(=O)c3cc(=O)c4c(OCc5ccc(F)cc5)cccc4o3)c2c1
: