Target
Acetylcholinesterase
Ligand
BDBM11682
Substrate
Meas. Tech.
ChEMBL_1624439 (CHEMBL3866851)
Ki
5680±n/a nM
Citation
 Kulshreshtha, APiplani, P Ameliorative effects of amide derivatives of 1,3,4-thiadiazoles on scopolamine induced cognitive dysfunction. Eur J Med Chem 122:557-573 (2016)  
Target
Name:
Acetylcholinesterase
Synonyms:
ACES_MOUSE Acetylcholinesterase (mouse AChE) Ache
Type:
Enzyme
Mol. Mass.:
68165.65
Organism:
Mus musculus (mouse)
Description:
Residue:
614
  
Inhibitor
Name:
BDBM11682
Synonyms:
2,3-dihydroxybutanedioic acid; 3-[(1S)-1-(dimethylamino)ethyl]phenyl N-ethyl-N-methylcarbamate US9586925, Rivastigmine
Type:
Small organic molecule
Emp. Form.:
C14H22N2O2
Mol. Mass.:
250.3367
SMILES:
CCN(C)C(=O)Oc1cccc(c1)[C@H](C)N(C)C
: