Target
Acetylcholinesterase
Ligand
BDBM50202499
Substrate
Meas. Tech.
ChEMBL_1624443 (CHEMBL3866855)
Ki
2670±n/a nM
Citation
 Kulshreshtha, APiplani, P Ameliorative effects of amide derivatives of 1,3,4-thiadiazoles on scopolamine induced cognitive dysfunction. Eur J Med Chem 122:557-573 (2016)  
Target
Name:
Acetylcholinesterase
Synonyms:
ACES_MOUSE Acetylcholinesterase (mouse AChE) Ache
Type:
Enzyme
Mol. Mass.:
68165.65
Organism:
Mus musculus (mouse)
Description:
Residue:
614
  
Inhibitor
Name:
BDBM50202499
Synonyms:
CHEMBL3960527
Type:
Small organic molecule
Emp. Form.:
C17H22ClN3OS
Mol. Mass.:
351.894
SMILES:
CC(CC(=O)Nc1nnc(s1)-c1cccc(Cl)c1)CC(C)(C)C
: