Target
Acetylcholinesterase
Ligand
BDBM50202508
Substrate
Meas. Tech.
ChEMBL_1624439 (CHEMBL3866851)
Ki
910±n/a nM
Citation
 Kulshreshtha, APiplani, P Ameliorative effects of amide derivatives of 1,3,4-thiadiazoles on scopolamine induced cognitive dysfunction. Eur J Med Chem 122:557-573 (2016)  
Target
Name:
Acetylcholinesterase
Synonyms:
ACES_MOUSE Acetylcholinesterase (mouse AChE) Ache
Type:
Enzyme
Mol. Mass.:
68165.65
Organism:
Mus musculus (mouse)
Description:
Residue:
614
  
Inhibitor
Name:
BDBM50202508
Synonyms:
CHEMBL3962271
Type:
Small organic molecule
Emp. Form.:
C17H13N3O3S
Mol. Mass.:
339.368
SMILES:
CC(=O)Oc1cccc(c1)C(=O)Nc1nnc(s1)-c1ccccc1
: