Target
M-phase inducer phosphatase 2
Ligand
BDBM50201798
Substrate
Meas. Tech.
ChEMBL_1625486 (CHEMBL3867955)
IC50
3390000±n/a nM
Citation
 Meng, GZheng, MWang, MTong, JGe, WZhang, JZheng, ALi, JGao, LLi, J Design and synthesis of new potent PTP1B inhibitors with the skeleton of 2-substituted imino-3-substituted-5-heteroarylidene-1,3-thiazolidine-4-one: Part I. Eur J Med Chem 122:756-769 (2016)  
Target
Name:
M-phase inducer phosphatase 2
Synonyms:
CDC25B Dual specificity phosphatase (CDC25B) M-phase inducer phosphatase 2 (CDC25B) | MPIP2_HUMAN
Type:
Protein
Mol. Mass.:
64985.27
Organism:
Homo sapiens (Human)
Description:
Residue:
580
  
Inhibitor
Name:
BDBM50201798
Synonyms:
CHEMBL3944187
Type:
Small organic molecule
Emp. Form.:
C25H21F2N3O3S
Mol. Mass.:
481.514
SMILES:
CCOC(=O)c1c(C)[nH]c(\C=C2/S\C(=N/c3cccc(F)c3)N(C2=O)c2cccc(F)c2)c1C
: