Target
Tyrosine-protein kinase JAK3
Ligand
BDBM50201811
Substrate
Meas. Tech.
ChEMBL_1625599 (CHEMBL3868068)
IC50
1724±n/a nM
Citation
 Wang, YHuang, WXin, MChen, PGui, LZhao, XTang, FWang, JLiu, F Identification of 4-(2-furanyl)pyrimidin-2-amines as Janus kinase 2 inhibitors. Bioorg Med Chem 25:75-83 (2017)  
Target
Name:
Tyrosine-protein kinase JAK3
Synonyms:
JAK3_MOUSE | Jak3
Type:
PROTEIN
Mol. Mass.:
122646.85
Organism:
Mus musculus
Description:
ChEMBL_1368188
Residue:
1100
  
Inhibitor
Name:
BDBM50201811
Synonyms:
CHEMBL3966342
Type:
Small organic molecule
Emp. Form.:
C24H21N5O2
Mol. Mass.:
411.4558
SMILES:
Cc1cnc(Nc2ccc(cc2)N2CCOCC2)nc1-c1cc2cc(ccc2o1)C#N
: