Target
Steroid 21-hydroxylase
Ligand
BDBM50203337
Substrate
Meas. Tech.
ChEMBL_1625605 (CHEMBL3868074)
IC50
20±n/a nM
Citation
 Blass, BEIyer, PAbou-Gharbia, MChilders, WEGordon, JCRamanjulu, MMorton, GArumugam, PBoruwa, JEllingboe, JMitra, SNimmareddy, RRPaliwal, SRajasekhar, JShivakumar, SSrivastava, PTangirala, RSVenkataramanaiah, KYanamandra, M Design, synthesis, and evaluation of (2S,4R)-Ketoconazole sulfonamide analogs as potential treatments for Metabolic Syndrome. Bioorg Med Chem Lett 26:5825-5829 (2016)  
Target
Name:
Steroid 21-hydroxylase
Synonyms:
CP21A_HUMAN CYP21A2 Cytochrome P450 21 | Cytochrome P450 21A2
Type:
PROTEIN
Mol. Mass.:
55896.25
Organism:
Homo sapiens (Human)
Description:
ChEMBL_1498865
Residue:
494
  
Inhibitor
Name:
BDBM50203337
Synonyms:
CHEMBL3980889
Type:
Small organic molecule
Emp. Form.:
C26H30Cl2N4O7S2
Mol. Mass.:
645.575
SMILES:
CS(=O)(=O)CS(=O)(=O)N1CCN(CC1)c1ccc(OC[C@@H]2CO[C@](Cn3ccnc3)(O2)c2ccc(Cl)cc2Cl)cc1
: