Target
Beta-secretase 1
Ligand
BDBM50203703
Substrate
Meas. Tech.
ChEMBL_1625840 (CHEMBL3868309)
IC50
37±n/a nM
Citation
 Wu, YJGuernon, JRajamani, RToyn, JHAhlijanian, MKAlbright, CFMuckelbauer, JChang, CCamac, DMacor, JEThompson, LA Discovery of furo[2,3-d][1,3]thiazinamines as beta amyloid cleaving enzyme-1 (BACE1) inhibitors. Bioorg Med Chem Lett 26:5729-5731 (2016)  
Target
Name:
Beta-secretase 1
Synonyms:
ASP2 Aspartyl protease 2 BACE1 Beta-secretase (BACE) Beta-secretase 1 (BACE 1) Beta-secretase 1 (BACE1) Beta-site amyloid precursor protein cleaving enzyme 1 Memapsin-2 beta-Secretase (BACE-1) | beta-Secretase (BACE1)
Type:
Protein
Mol. Mass.:
55755.10
Organism:
Homo sapiens (Human)
Description:
P56817
Residue:
501
  
Inhibitor
Name:
BDBM50203703
Synonyms:
CHEMBL3980733
Type:
Small organic molecule
Emp. Form.:
C19H16FN5O2S
Mol. Mass.:
397.426
SMILES:
[H][C@@]12CCO[C@@]1(N=C(N)SC2)c1cc(NC(=O)c2ccc(cn2)C#N)ccc1F
: