Target
Aldo-keto reductase family 1 member C3
Ligand
BDBM50396694
Substrate
Meas. Tech.
ChEBML_1626011
IC50
8.9±n/a nM
Citation
 Zheng, XWu, YWu, DWang, XZhang, CGuo, XLuo, HB 3D-QSAR studies of 3-(3,4-dihydroisoquinolin-2(1H)-ylsulfonyl)benzoic acids as AKR1C3 inhibitors: Highlight the importance of molecular docking in conformation generation. Bioorg Med Chem Lett 26:5631-5638 (2016)  
Target
Name:
Aldo-keto reductase family 1 member C3
Synonyms:
17-beta-Hydroxysteroid Dehydrogenase 5 (17-beta-HSD5, AKR1C3) AK1C3_HUMAN Aldo-keto reductase family 1 member C3 Aldo-keto reductase family 1 member C3 (AK1C3a) Aldo-keto-reductase family 1 member C3 Dihydrodiol dehydrogenase 3 Estradiol 17-beta-dehydrogenase KIAA0119 Prostaglandin F synthase Trans-1,2-dihydrobenzene-1,2-diol dehydrogenase
Type:
Enzyme
Mol. Mass.:
36859.86
Organism:
Homo sapiens (Human)
Description:
P42330
Residue:
323
  
Inhibitor
Name:
BDBM50396694
Synonyms:
CHEMBL2172112
Type:
Small organic molecule
Emp. Form.:
C16H14N2O6S
Mol. Mass.:
362.357
SMILES:
OC(=O)c1cccc(c1)S(=O)(=O)N1CCc2c(C1)cccc2[N+]([O-])=O
: