Target
Prostaglandin G/H synthase 1
Ligand
BDBM50074922
Substrate
Meas. Tech.
ChEMBL_1627355 (CHEMBL3869876)
IC50
1995±n/a nM
Citation
 Swiatek, PStrzelecka, MUrniaz, RGebczak, KGebarowski, TGasiorowski, KMalinka, W Synthesis, COX-1/2 inhibition activities and molecular docking study of isothiazolopyridine derivatives. Bioorg Med Chem 25:316-326 (2017)  
Target
Name:
Prostaglandin G/H synthase 1
Synonyms:
COX-1 Cyclooxygenase Cyclooxygenase-1 (COX-1) PTGS1 | Prostaglandin G/H synthase (cyclooxygenase)
Type:
Enzyme
Mol. Mass.:
68692.62
Organism:
Homo sapiens (Human)
Description:
P23219
Residue:
599
  
Inhibitor
Name:
BDBM50074922
Synonyms:
(+-)-2-fluoro-alpha-methyl-4-biphenylacetic acid 2-(2-fluorobiphenyl-4-yl)propanoic acid 3-fluoro-4-phenylhydratropic acid CHEMBL563 US9630914, Compound A
Type:
Small organic molecule
Emp. Form.:
C15H13FO2
Mol. Mass.:
244.2609
SMILES:
CC(C(O)=O)c1ccc(c(F)c1)-c1ccccc1
: