Target
Calcium release-activated calcium channel protein 1
Ligand
BDBM50204538
Substrate
Meas. Tech.
ChEMBL_1627486 (CHEMBL3870007)
IC50
67000±n/a nM
Citation
 Azimi, IFlanagan, JUStevenson, RJInserra, MVetter, IMonteith, GRDenny, WA Evaluation of known and novel inhibitors of Orai1-mediated store operated Ca Bioorg Med Chem 25:440-449 (2017)  
Target
Name:
Calcium release-activated calcium channel protein 1
Synonyms:
CRACM1 Calcium channel (VER) Calcium release-activated calcium channel protein 1 Protein orai-1 Transmembrane protein 142A
Type:
Protein
Mol. Mass.:
32676.63
Organism:
Homo sapiens (Human)
Description:
Q96D31
Residue:
301
  
Inhibitor
Name:
BDBM50204538
Synonyms:
CHEMBL3913392
Type:
Small organic molecule
Emp. Form.:
C23H28N2O3
Mol. Mass.:
380.48
SMILES:
COc1ccc(CCCCOC(Cn2ccnc2)c2ccc(OC)cc2)cc1
: