Target
Alpha-galactosidase A
Ligand
BDBM50204611
Substrate
Meas. Tech.
ChEBML_1627785
pH
7±n/a
IC50
9500±n/a nM
Comments
extracted
Citation
 Cheng, WCWang, JHLi, HYLu, SJHu, JMYun, WYChiu, CHYang, WBChien, YHHwu, WL Bioevaluation of sixteen ADMDP stereoisomers toward alpha-galactosidase A: Development of a new pharmacological chaperone for the treatment of Fabry disease and potential enhancement of enzyme replacement therapy efficiency. Eur J Med Chem 123:14-20 (2016)  
Target
Name:
Alpha-galactosidase A
Synonyms:
AGAL_HUMAN Alpha-D-galactoside galactohydrolase Alpha-glucosidase A (α-Gal A) INN=Agalsidase | Melibiase
Type:
Protein
Mol. Mass.:
48760.21
Organism:
Homo sapiens (Human)
Description:
Residue:
429
  
Inhibitor
Name:
BDBM50204611
Synonyms:
CHEMBL1289018 | D-15
Type:
Small organic molecule
Emp. Form.:
C5H11NO3
Mol. Mass.:
133.1457
SMILES:
OC[C@H]1NC[C@@H](O)[C@H]1O
: