Target
Cholinesterase
Ligand
BDBM50029921
Substrate
Meas. Tech.
ChEMBL_1627941 (CHEMBL3870526)
IC50
31100±n/a nM
Citation
 Wang, ZMCai, PLiu, QHXu, DQYang, XLWu, JJKong, LYWang, XB Rational modification of donepezil as multifunctional acetylcholinesterase inhibitors for the treatment of Alzheimer's disease. Eur J Med Chem 123:282-297 (2016)  
Target
Name:
Cholinesterase
Synonyms:
BCHE CHLE_HORSE | Cholinesterase
Type:
Enzyme
Mol. Mass.:
65643.35
Organism:
Equus caballus (Horse)
Description:
P81908
Residue:
574
  
Inhibitor
Name:
BDBM50029921
Synonyms:
5,6-Dimethoxy-2-[1-(2-nitro-benzyl)-piperidin-4-ylmethyl]-indan-1-one | CHEMBL145361
Type:
Small organic molecule
Emp. Form.:
C24H28N2O5
Mol. Mass.:
424.4895
SMILES:
COc1cc2CC(CC3CCN(Cc4ccccc4[N+]([O-])=O)CC3)C(=O)c2cc1OC
: