Target
Acetylcholinesterase
Ligand
BDBM50204835
Substrate
Meas. Tech.
ChEMBL_1627946 (CHEMBL3870531)
IC50
97±n/a nM
Citation
 Wang, ZMCai, PLiu, QHXu, DQYang, XLWu, JJKong, LYWang, XB Rational modification of donepezil as multifunctional acetylcholinesterase inhibitors for the treatment of Alzheimer's disease. Eur J Med Chem 123:282-297 (2016)  
Target
Name:
Acetylcholinesterase
Synonyms:
ACES_HUMAN Acetylcholinesterase (AChE) | Acetylcholinesterase (human AChE)
Type:
Enzyme
Mol. Mass.:
67792.70
Organism:
Homo sapiens (Human)
Description:
P22303
Residue:
614
  
Inhibitor
Name:
BDBM50204835
Synonyms:
CHEMBL3933395
Type:
Small organic molecule
Emp. Form.:
C24H28ClNO3
Mol. Mass.:
413.937
SMILES:
COc1cc2CC(CC3CCN(Cc4ccccc4Cl)CC3)C(=O)c2cc1OC
: