Target
Acetylcholinesterase
Ligand
BDBM50204842
Substrate
Meas. Tech.
ChEMBL_1627988 (CHEMBL3870573)
IC50
52±n/a nM
Citation
 Pourabdi, LKhoobi, MNadri, HMoradi, AMoghadam, FHEmami, SMojtahedi, MMHaririan, IForootanfar, HAmeri, AForoumadi, AShafiee, A Synthesis and structure-activity relationship study of tacrine-based pyrano[2,3-c]pyrazoles targeting AChE/BuChE and 15-LOX. Eur J Med Chem 123:298-308 (2016)  
Target
Name:
Acetylcholinesterase
Synonyms:
ACES_ELEEL Acetylcholinesterase (EeAChE) | ache
Type:
Enzyme
Mol. Mass.:
71812.79
Organism:
Electrophorus electricus (Electric eel)
Description:
Residue:
633
  
Inhibitor
Name:
BDBM50204842
Synonyms:
CHEMBL3927698
Type:
Small organic molecule
Emp. Form.:
C23H26N4O2
Mol. Mass.:
390.4781
SMILES:
CCCc1n[nH]c2Oc3nc4CCCCc4c(N)c3C(c12)c1ccc(OC)cc1
: