Target
Cytochrome P450 3A4
Ligand
BDBM50205193
Substrate
Meas. Tech.
ChEMBL_1628093 (CHEMBL3870678)
IC50
8000±n/a nM
Citation
 Zhao, ZPissarnitski, DAJosien, HBBara, TAClader, JWLi, HMcBriar, MDRajagopalan, MXu, RTerracina, GHyde, LSong, LZhang, LParker, EMOsterman, RBuevich, AV Substituted 4-morpholine N-arylsulfonamides as¿-secretase inhibitors. Eur J Med Chem 124:36-48 (2016)  
Target
Name:
Cytochrome P450 3A4
Synonyms:
Albendazole monooxygenase CP3A4_HUMAN CYP3A4 CYPIIIA4 Cytochrome P450 3A4 (CYP3A4) Nifedipine oxidase Taurochenodeoxycholate 6-alpha-hydroxylase
Type:
Enzyme
Mol. Mass.:
57349.57
Organism:
Homo sapiens (Human)
Description:
Residue:
503
  
Inhibitor
Name:
BDBM50205193
Synonyms:
CHEMBL3942592
Type:
Small organic molecule
Emp. Form.:
C28H40ClN3O4S
Mol. Mass.:
550.153
SMILES:
[H][C@]12CCC[C@@]1([H])N([C@H](CO2)C1(CC(=O)N2CCC(CC2)N2CCCCC2)CC1)S(=O)(=O)c1ccc(Cl)cc1
: