Target
Coagulation factor VII/Tissue factor
Ligand
BDBM50205845
Substrate
Meas. Tech.
ChEMBL_1628565 (CHEMBL3871150)
Ki
150±n/a nM
Citation
 Richter, JMCheney, DLBates, JAWei, ALuettgen, JMRendina, ARHarper, TMNarayanan, RWong, PCSeiffert, DWexler, RRPriestley, ES Design and Synthesis of Novel Meta-Linked Phenylglycine Macrocyclic FVIIa Inhibitors. ACS Med Chem Lett 8:67-72 (2017)  
Target
Name:
Coagulation factor VII/Tissue factor
Synonyms:
Coagulation factor III/Factor VIIa (fVIIa) | Coagulation factor III/VII
Type:
Mol. Mass.:
Description:
ASSAY_ID of EBI is 69535
Components:
This complex has 2 components.
Component 1
Name:
Tissue factor
Synonyms:
CD_antigen=CD142 Coagulation factor VII/tissue factor TF Thromboplastin | Tissue factor
Type:
PROTEIN
Mol. Mass.:
33067.61
Organism:
Homo sapiens (Human)
Description:
ChEMBL_936735
Residue:
295
  
Component 2
Name:
Coagulation factor VII
Synonyms:
Eptacog alfa FA7_HUMAN Factor VIIa (fVIIa) SPCA serum prothrombin conversion accelerator
Type:
Enzyme
Mol. Mass.:
51599.89
Organism:
Homo sapiens (Human)
Description:
Residue:
466
  
Inhibitor
Name:
BDBM50205845
Synonyms:
CHEMBL3890575
Type:
Small organic molecule
Emp. Form.:
C36H39FN6O4S
Mol. Mass.:
670.796
SMILES:
CN1Cc2cc(NC(=O)N(CC3CCC3)CCc3cccc(c3)C(Nc3ccc4c(N)ncc(F)c4c3)C1=O)ccc2S(=O)(=O)C1CC1
: