Target
Neuronal acetylcholine receptor subunit alpha-7
Ligand
BDBM50206264
Substrate
Meas. Tech.
ChEMBL_1628642 (CHEMBL3871227)
EC50
41±n/a nM
Citation
 Hill, MDFang, HKing, HDIwuagwu, CIMcDonald, IMCook, JZusi, FCMate, RAKnox, RJPost-Munson, DEaston, AMiller, RLentz, KClarke, WBenitex, YLodge, NZaczek, RDenton, RMorgan, DBristow, LMacor, JEOlson, R Development of 4-Heteroarylamino-1'-azaspiro[oxazole-5,3'-bicyclo[2.2.2]octanes] asa7 Nicotinic Receptor Agonists. ACS Med Chem Lett 8:133-137 (2017)  
Target
Name:
Neuronal acetylcholine receptor subunit alpha-7
Synonyms:
ACHA7_HUMAN Cholinergic, Nicotinic Alpha7 Neuronal acetylcholine receptor protein alpha-7 subunit Nicotinic acetylcholine receptor alpha-7 (alpha7 nAChR)
Type:
Mol. Mass.:
56448.33
Organism:
Homo sapiens (Human)
Description:
CHRNA7 (NACHRA7)
Residue:
502
  
Inhibitor
Name:
BDBM50206264
Synonyms:
CHEMBL3957600
Type:
Small organic molecule
Emp. Form.:
C15H18N6O
Mol. Mass.:
298.343
SMILES:
C1N=C(Nc2ncnn3cccc23)O[C@]11CN2CCC1CC2
: