Target
Neuronal acetylcholine receptor subunit alpha-7
Ligand
BDBM50206268
Substrate
Meas. Tech.
ChEMBL_1628642 (CHEMBL3871227)
EC50
31±n/a nM
Citation
 Hill, MDFang, HKing, HDIwuagwu, CIMcDonald, IMCook, JZusi, FCMate, RAKnox, RJPost-Munson, DEaston, AMiller, RLentz, KClarke, WBenitex, YLodge, NZaczek, RDenton, RMorgan, DBristow, LMacor, JEOlson, R Development of 4-Heteroarylamino-1'-azaspiro[oxazole-5,3'-bicyclo[2.2.2]octanes] asa7 Nicotinic Receptor Agonists. ACS Med Chem Lett 8:133-137 (2017)  
Target
Name:
Neuronal acetylcholine receptor subunit alpha-7
Synonyms:
ACHA7_HUMAN Cholinergic, Nicotinic Alpha7 Neuronal acetylcholine receptor protein alpha-7 subunit Nicotinic acetylcholine receptor alpha-7 (alpha7 nAChR)
Type:
Mol. Mass.:
56448.33
Organism:
Homo sapiens (Human)
Description:
CHRNA7 (NACHRA7)
Residue:
502
  
Inhibitor
Name:
BDBM50206268
Synonyms:
CHEMBL3891441
Type:
Small organic molecule
Emp. Form.:
C16H20N6O
Mol. Mass.:
312.3696
SMILES:
Cn1ccc2c(NC3=NC[C@@]4(CN5CCC4CC5)O3)ncnc12
: