Target
Thioredoxin reductase
Ligand
BDBM50375309
Substrate
Meas. Tech.
ChEMBL_1629022 (CHEMBL3871648)
Ki
3300±n/a nM
Citation
 Ansari, MFSiddiqui, SMAhmad, KAvecilla, FDharavath, SGourinath, SAzam, A Synthesis, antiamoebic and molecular docking studies of furan-thiazolidinone hybrids. Eur J Med Chem 124:393-406 (2016)  
Target
Name:
Thioredoxin reductase
Synonyms:
Type:
PROTEIN
Mol. Mass.:
33740.27
Organism:
Entamoeba histolytica
Description:
ChEMBL_116971
Residue:
314
  
Inhibitor
Name:
BDBM50375309
Synonyms:
BAY-5360 Flagyl 375 Flagyl i.v. rtu in plastic container Metric 21 Metro i.v. Metrocream Metrolotion Metromidol
Type:
Small organic molecule
Emp. Form.:
C6H9N3O3
Mol. Mass.:
171.154
SMILES:
Cc1ncc(n1CCO)[N+]([O-])=O
: