Target
Induced myeloid leukemia cell differentiation protein Mcl-1
Ligand
BDBM50206535
Substrate
Meas. Tech.
ChEMBL_1629122 (CHEMBL3871748)
Ki
780±n/a nM
Citation
 Wan, YLiu, TLi, XChen, CFang, H Improved binding affinities of pyrrolidine derivatives as Mcl-1 inhibitors by modifying amino acid side chains. Bioorg Med Chem 25:138-152 (2017)  
Target
Name:
Induced myeloid leukemia cell differentiation protein Mcl-1
Synonyms:
BCL2L3 Bcl-2-like protein 3 (Mcl-1) Bcl2-L-3 MCL1 Mcl-1 Myeloid cell leukemia sequence 1 (BCL2-related) | mcl1/EAT
Type:
Membrane; Single-pass membrane protein
Mol. Mass.:
37332.87
Organism:
Homo sapiens (Human)
Description:
Q07820
Residue:
350
  
Inhibitor
Name:
BDBM50206535
Synonyms:
CHEMBL3980896
Type:
Small organic molecule
Emp. Form.:
C44H51ClN4O10S
Mol. Mass.:
863.415
SMILES:
CCCCCCOc1ccc(C[C@H](NC(=O)[C@@H]2C[C@@H](CN2C(=O)OC(C)(C)C)Oc2ccc(cc2)-c2ccc(C)cc2)C(=O)NS(=O)(=O)c2ccc(Cl)c(c2)[N+]([O-])=O)cc1
: